BDBM50049639 3,4',5'-Trifluoro-4-methoxy-[1,1';2',1'']terphenyl-4''-sulfonic acid amide::CHEMBL55072
SMILES COc1ccc(cc1F)-c1cc(F)c(F)cc1-c1ccc(cc1)S(N)(=O)=O
InChI Key InChIKey=XYPOZNYKHAQGHD-UHFFFAOYSA-N
Data  3 IC50
  Tab Delimited (TSV)   2D SDfile   Computed 3D by Vconf -m prep SDfile
Find this compound or compounds like it in BindingDB:
Activity Spreadsheet -- Enzyme Inhibition Constant Data from BindingDB
Found 3 hits for monomerid = 50049639
TargetProstaglandin G/H synthase 1(Homo sapiens (Human))
Searle Research And Development
Curated by ChEMBL
LigandPNGBDBM50049639(3,4',5'-Trifluoro-4-methoxy-[1,1';2',1'']terphenyl...)
Affinity DataIC50:  2.25E+4nM. Assay description: In vitro inhibitory activity against human recombinant prostaglandin G/H synthase 1.
In DepthDetails ArticlePubMed
TargetProstaglandin G/H synthase 2(Homo sapiens (Human))
Universit£
Curated by ChEMBL
LigandPNGBDBM50049639(3,4',5'-Trifluoro-4-methoxy-[1,1';2',1'']terphenyl...)
Affinity DataIC50:  12.9nM. Assay description: Inhibition of human Prostaglandin G/H synthase 2
In DepthDetails ArticlePubMed
TargetProstaglandin G/H synthase 2(Homo sapiens (Human))
Universit£
Curated by ChEMBL
LigandPNGBDBM50049639(3,4',5'-Trifluoro-4-methoxy-[1,1';2',1'']terphenyl...)
Affinity DataIC50:  13nM. Assay description: In vitro inhibitory activity against human recombinant prostaglandin G/H synthase 2
In DepthDetails ArticlePubMed