BDBM50049646 3-Chloro-4-dimethylamino-4',5'-difluoro-[1,1';2',1'']terphenyl-4''-sulfonic acid amide::CHEMBL52872
SMILES CN(C)c1ccc(cc1Cl)-c1cc(F)c(F)cc1-c1ccc(cc1)S(N)(=O)=O
InChI Key InChIKey=LLUUVZZXTDQWCM-UHFFFAOYSA-N
Data  3 IC50
  Tab Delimited (TSV)   2D SDfile   Computed 3D by Vconf -m prep SDfile
Find this compound or compounds like it in BindingDB:
Activity Spreadsheet -- Enzyme Inhibition Constant Data from BindingDB
Found 3 hits for monomerid = 50049646
TargetProstaglandin G/H synthase 1(Homo sapiens (Human))
Searle Research And Development
Curated by ChEMBL
LigandPNGBDBM50049646(3-Chloro-4-dimethylamino-4',5'-difluoro-[1,1';2',1...)
Affinity DataIC50:  590nM. Assay description: In vitro inhibitory activity against human recombinant prostaglandin G/H synthase 1.
In DepthDetails ArticlePubMed
TargetProstaglandin G/H synthase 2(Homo sapiens (Human))
Universit£
Curated by ChEMBL
LigandPNGBDBM50049646(3-Chloro-4-dimethylamino-4',5'-difluoro-[1,1';2',1...)
Affinity DataIC50:  6.03nM. Assay description: Inhibition of human Prostaglandin G/H synthase 2
In DepthDetails ArticlePubMed
TargetProstaglandin G/H synthase 2(Homo sapiens (Human))
Universit£
Curated by ChEMBL
LigandPNGBDBM50049646(3-Chloro-4-dimethylamino-4',5'-difluoro-[1,1';2',1...)
Affinity DataIC50:  6nM. Assay description: In vitro inhibitory activity against human recombinant prostaglandin G/H synthase 2
In DepthDetails ArticlePubMed