BDBM50049786 1-((R)-1-Methyl-2-oxo-5-phenyl-2,3-dihydro-1H-benzo[e][1,4]diazepin-3-yl)-3-{3-[methyl-(1H-tetrazol-5-yl)-amino]-phenyl}-urea::CHEMBL22003
SMILES CN(c1nnn[nH]1)c1cccc(NC(=O)N[C@@H]2N=C(c3ccccc3)c3ccccc3N(C)C2=O)c1
InChI Key InChIKey=QFHQGRDCNWYXBA-QFIPXVFZSA-N
Data  2 IC50
  Tab Delimited (TSV)   2D SDfile   Computed 3D by Vconf -m prep SDfile
Find this compound or compounds like it in BindingDB:
Activity Spreadsheet -- Enzyme Inhibition Constant Data from BindingDB
Found 2 hits for monomerid = 50049786
TargetCholecystokinin receptor type A(RAT)
Neuroscience Research Centre
Curated by ChEMBL
LigandPNGBDBM50049786(1-((R)-1-Methyl-2-oxo-5-phenyl-2,3-dihydro-1H-benz...)
Affinity DataIC50:  3.00E+3nM. Assay description: Inhibition of [125 I]BH CCK-8S binding to Cholecystokinin type A receptor in pancreatic tissue
In DepthDetails ArticlePubMed
TargetGastrin/cholecystokinin type B receptor(Homo sapiens (Human))
Neuroscience Research Centre
Curated by ChEMBL
LigandPNGBDBM50049786(1-((R)-1-Methyl-2-oxo-5-phenyl-2,3-dihydro-1H-benz...)
Affinity DataIC50:  0.580nM. Assay description: Inhibition of [125 I]BH CCK-8S binding to Cholecystokinin type B receptor in guinea pig cortical membranes
In DepthDetails ArticlePubMed