BDBM50050174 3-(3-Iodo-4-methoxy-phenyl)-propionic acid 3-(1H-imidazol-4-yl)-propyl ester::CHEMBL20147
SMILES COc1ccc(CCC(=O)OCCCc2cnc[nH]2)cc1I
InChI Key InChIKey=KMRGPDJHHRRXTP-UHFFFAOYSA-N
Data  3 KI
  Tab Delimited (TSV)   2D SDfile   Computed 3D by Vconf -m prep SDfile
Find this compound or compounds like it in BindingDB:
Activity Spreadsheet -- Enzyme Inhibition Constant Data from BindingDB
Found 3 hits for monomerid = 50050174
TargetHistamine H3 receptor(Rattus norvegicus (rat))
Freie UniversitäT Berlin
Curated by ChEMBL
LigandPNGBDBM50050174(3-(3-Iodo-4-methoxy-phenyl)-propionic acid 3-(1H-i...)
Affinity DataKi:  200nM. Assay description: Binding affinity towards Histamine H3 receptor on synaptosomes from rat cerebral cortex
In DepthDetails ArticlePubMed
TargetHistamine H3 receptor(Rattus norvegicus (rat))
Freie UniversitäT Berlin
Curated by ChEMBL
LigandPNGBDBM50050174(3-(3-Iodo-4-methoxy-phenyl)-propionic acid 3-(1H-i...)
Affinity DataKi:  232nM. Assay description: In vitro antagonistic activity tested against Histamine H3 receptor on synaptosomes from rat cerebral cortex
In DepthDetails ArticlePubMed
TargetHistamine H3 receptor(Rattus norvegicus (rat))
Freie UniversitäT Berlin
Curated by ChEMBL
LigandPNGBDBM50050174(3-(3-Iodo-4-methoxy-phenyl)-propionic acid 3-(1H-i...)
Affinity DataKi:  251nM. Assay description: In vitro antagonistic activity tested against Histamine H3 receptor on synaptosomes from rat cerebral cortex
In DepthDetails ArticlePubMed