BDBM50050397 6-(4-Chloro-phenylsulfanylmethyl)-5-methyl-pyrido[2,3-d]pyrimidine-2,4-diamine::CHEMBL22677::xv6-(4-Chloro-phenylsulfanylmethyl)-5-methyl-pyrido[2,3-d]pyrimidine-2,4-diamine
SMILES Cc1c(CSc2ccc(Cl)cc2)cnc2nc(N)nc(N)c12
InChI Key InChIKey=UXHWDAJRTNZWPO-UHFFFAOYSA-N
Data  5 IC50
  Tab Delimited (TSV)   2D SDfile   Computed 3D by Vconf -m prep SDfile
Find this compound or compounds like it in BindingDB:
Activity Spreadsheet -- Enzyme Inhibition Constant Data from BindingDB
Found 5 hits for monomerid = 50050397
TargetBifunctional dihydrofolate reductase-thymidylate synthase(Toxoplasma gondii)
Southern Research Institute
Curated by ChEMBL
LigandPNGBDBM50050397(6-(4-Chloro-phenylsulfanylmethyl)-5-methyl-pyrido[...)
Affinity DataIC50:  90nM. Assay description: Inhibitory activity against Toxoplasma gondii dihydrofolate reductase
In DepthDetails ArticlePubMed
TargetDihydrofolate reductase(Pneumocystis carinii)
Southern Research Institute
Curated by ChEMBL
LigandPNGBDBM50050397(6-(4-Chloro-phenylsulfanylmethyl)-5-methyl-pyrido[...)
Affinity DataIC50:  360nM. Assay description: Inhibitory activity against Pneumocystis carinii dihydrofolate reductase
In DepthDetails ArticlePubMed
TargetDihydrofolate reductase(Homo sapiens (Human))
Lindsley F. Kimball Research Institute
Curated by ChEMBL
LigandPNGBDBM50050397(6-(4-Chloro-phenylsulfanylmethyl)-5-methyl-pyrido[...)
Affinity DataIC50:  3.60nM. Assay description: Antimycobacterial activity against Mycobacterium avium complex diihydrofolate reductase (MAC DHFR)
In DepthDetails ArticlePubMed
TargetDihydrofolate reductase(Homo sapiens (Human))
Lindsley F. Kimball Research Institute
Curated by ChEMBL
LigandPNGBDBM50050397(6-(4-Chloro-phenylsulfanylmethyl)-5-methyl-pyrido[...)
Affinity DataIC50:  590nM. Assay description: Antimycobacterial activity against human dihydrofolate reductase (hDHFR)
In DepthDetails ArticlePubMed
TargetDihydrofolate reductase(Rattus norvegicus (rat))
Southern Research Institute
Curated by ChEMBL
LigandPNGBDBM50050397(6-(4-Chloro-phenylsulfanylmethyl)-5-methyl-pyrido[...)
Affinity DataIC50:  370nM. Assay description: Inhibitory activity of the compound against rat liver dihydrofolate reductase
In DepthDetails ArticlePubMed