BDBM50050400 6-(Naphthalen-1-ylaminomethyl)-quinazoline-2,4-diamine::CHEMBL23211
SMILES Nc1nc(N)c2cc(CNc3cccc4ccccc34)ccc2n1
InChI Key InChIKey=OIWLBXVOEQWTCG-UHFFFAOYSA-N
Data  3 IC50
  Tab Delimited (TSV)   2D SDfile   Computed 3D by Vconf -m prep SDfile
Find this compound or compounds like it in BindingDB:
Activity Spreadsheet -- Enzyme Inhibition Constant Data from BindingDB
Found 3 hits for monomerid = 50050400
TargetBifunctional dihydrofolate reductase-thymidylate synthase(Toxoplasma gondii)
Southern Research Institute
Curated by ChEMBL
LigandPNGBDBM50050400(6-(Naphthalen-1-ylaminomethyl)-quinazoline-2,4-dia...)
Affinity DataIC50:  27nM. Assay description: Inhibitory activity against Toxoplasma gondii dihydrofolate reductase
In DepthDetails ArticlePubMed
TargetDihydrofolate reductase(Rattus norvegicus (rat))
Southern Research Institute
Curated by ChEMBL
LigandPNGBDBM50050400(6-(Naphthalen-1-ylaminomethyl)-quinazoline-2,4-dia...)
Affinity DataIC50:  55nM. Assay description: Inhibitory activity of the compound against rat liver dihydrofolate reductase
In DepthDetails ArticlePubMed
TargetDihydrofolate reductase(Pneumocystis carinii)
Southern Research Institute
Curated by ChEMBL
LigandPNGBDBM50050400(6-(Naphthalen-1-ylaminomethyl)-quinazoline-2,4-dia...)
Affinity DataIC50:  210nM. Assay description: Inhibitory activity against Pneumocystis carinii dihydrofolate reductase
In DepthDetails ArticlePubMed