BDBM50050512 Boronic acid derivative::CHEMBL65406
SMILES CC(C)[C@@H](N)C(=O)N1CCC[C@@H]1B(O)O
InChI Key InChIKey=FKCMADOPPWWGNZ-HTQZYQBOSA-N
Data  2 IC50
  Tab Delimited (TSV)   2D SDfile   Computed 3D by Vconf -m prep SDfile
Find this compound or compounds like it in BindingDB:
Activity Spreadsheet -- Enzyme Inhibition Constant Data from BindingDB
Found 2 hits for monomerid = 50050512
TargetDipeptidyl peptidase 4(Homo sapiens (Human))
Boehringer Ingelheim Pharmaceuticals
Curated by ChEMBL
LigandPNGBDBM50050512(Boronic acid derivative | CHEMBL65406)
Affinity DataIC50:  4.00E+3nM. Assay description: In vitro for inhibition of Dipeptidylpeptidase IV.
In DepthDetails ArticlePubMed
TargetDipeptidyl peptidase 2(Homo sapiens (Human))
Boehringer Ingelheim Pharmaceuticals
Curated by ChEMBL
LigandPNGBDBM50050512(Boronic acid derivative | CHEMBL65406)
Affinity DataIC50:  1.80E+4nM. Assay description: Compound was tested in vitro for inhibition of Dipeptidylpeptidase II
In DepthDetails ArticlePubMed