BDBM50050723 CHEMBL45495::N-[(1S,2R)-2-(3-Hydroxy-phenyl)-1,2,3,4-tetrahydro-naphthalen-1-yl]-2,2-diphenyl-acetamide
SMILES Oc1cccc(c1)[C@H]1CCc2ccccc2[C@H]1NC(=O)C(c1ccccc1)c1ccccc1
InChI Key InChIKey=NYWIQYRZOVMQRF-XRKRLSELSA-N
Data  1 IC50
  Tab Delimited (TSV)   2D SDfile   Computed 3D by Vconf -m prep SDfile
Find this compound or compounds like it in BindingDB:
Activity Spreadsheet -- Enzyme Inhibition Constant Data from BindingDB
Found 1 hit for monomerid = 50050723
TargetSterol O-acyltransferase 1(Rattus norvegicus)
Schering-Plough Research Institute
Curated by ChEMBL
LigandPNGBDBM50050723(CHEMBL45495 | N-[(1S,2R)-2-(3-Hydroxy-phenyl)-1,2,...)
Affinity DataIC50:  1.80E+3nM. Assay description: In vitro inhibitory activity against acyl-coenzyme A:cholesterol acyltransferase 1 from rat hepatic microsomes.
In DepthDetails ArticlePubMed