BDBM50051132 CHEMBL3318300
SMILES COc1cc2nc(nc(NCCCCCN3CCCC3)c2cc1OC)N1CCCCCC1
InChI Key InChIKey=UKVVKAINBHMZPL-UHFFFAOYSA-N
Data  1 IC50
  Tab Delimited (TSV)   2D SDfile   Computed 3D by Vconf -m prep SDfile
Find this compound or compounds like it in BindingDB:
Activity Spreadsheet -- Enzyme Inhibition Constant Data from BindingDB
Found 1 hit for monomerid = 50051132
TargetN-lysine methyltransferase KMT5A(Homo sapiens (Human))
University Of North Carolina At Chapel Hill
Curated by ChEMBL
LigandPNGBDBM50051132(CHEMBL3318300)
Affinity DataIC50: >2.50E+5nM. Assay description: Inhibition of SETD8 (unknown origin) catalytic domain expressed in Escherichia coli using biotinylated H4 (1-24) peptide substrate after 1 hr by scin...
In DepthDetails ArticlePubMed