BDBM50051170 CHEMBL412600::Cyclic Lactam Peptide Analogues of Dynorphin A(1-11)-NH2
SMILES CC[C@@H](C)[C@H]1NC(=O)[C@H](CCCNC(N)=N)NC(=O)[C@@H](CCCNC(N)=N)NC(=O)[C@@H](CCCCNC(=O)C[C@@H](NC1=O)C(=O)N1CCC[C@H]1C(=O)N[C@H](CCCCN)C(N)=O)NC(=O)[C@@H](Cc1ccccc1)NC(=O)CNC(=O)CNC(=O)[C@H](N)Cc1ccc(O)cc1
InChI Key InChIKey=AAMCVRWFZKNHTH-AKSNCSMTSA-N
Data  3 IC50
  Tab Delimited (TSV)   2D SDfile   Computed 3D by Vconf -m prep SDfile
Find this compound or compounds like it in BindingDB:
Activity Spreadsheet -- Enzyme Inhibition Constant Data from BindingDB
Found 3 hits for monomerid = 50051170
TargetKappa-type opioid receptor(Cavia porcellus (domestic guinea pig))
University Of Arizona
Curated by ChEMBL
LigandPNGBDBM50051170(CHEMBL412600 | Cyclic Lactam Peptide Analogues of ...)
Affinity DataIC50:  100nM. Assay description: Inhibition of [3H]U-69,593 binding to Opioid receptor kappa 1 of plasma membrane homogenates of guinea pig brain
In DepthDetails ArticlePubMed
TargetDelta-type opioid receptor(Homo sapiens (Human))
University Of Arizona
Curated by ChEMBL
LigandPNGBDBM50051170(CHEMBL412600 | Cyclic Lactam Peptide Analogues of ...)
Affinity DataIC50:  150nM. Assay description: Inhibition of [3H]c[D-Pen2,p-Cl-Phe4,D-Pen5]enkephalin binding to delta opioid receptor of guinea pig brain plasma membrane homogenates
In DepthDetails ArticlePubMed
TargetMu-type opioid receptor(GUINEA PIG)
University Of Arizona
Curated by ChEMBL
LigandPNGBDBM50051170(CHEMBL412600 | Cyclic Lactam Peptide Analogues of ...)
Affinity DataIC50:  120nM. Assay description: Inhibition of [3H]-DAMGO binding to Opioid receptor mu 1 of guinea pig brain membrane homogenates
In DepthDetails ArticlePubMed