BDBM50051253 CHEMBL544908::N-[4-(4-Benzo[d]isothiazol-3-yl-piperazin-1-yl)-butyl]-2-hydroxy-benzamide; hydrochloride
SMILES Oc1ccccc1C(=O)NCCCCN1CCN(CC1)c1nsc2ccccc12
InChI Key InChIKey=AWPMMEUZMRHIOP-UHFFFAOYSA-N
Data  2 IC50
  Tab Delimited (TSV)   2D SDfile   Computed 3D by Vconf -m prep SDfile
Find this compound or compounds like it in BindingDB:
Activity Spreadsheet -- Enzyme Inhibition Constant Data from BindingDB
Found 2 hits for monomerid = 50051253
Target5-hydroxytryptamine receptor 1A(Rattus norvegicus (rat))
Glaxo Wellcome
Curated by ChEMBL
LigandPNGBDBM50051253(CHEMBL544908 | N-[4-(4-Benzo[d]isothiazol-3-yl-pip...)
Affinity DataIC50:  12nM. Assay description: In vitro inhibitory activity against [3H]8-OH-DPAT binding to 5-hydroxytryptamine 1A receptor
In DepthDetails ArticlePubMed
TargetD(2) dopamine receptor(Rattus norvegicus (rat))
Glaxo Wellcome
Curated by ChEMBL
LigandPNGBDBM50051253(CHEMBL544908 | N-[4-(4-Benzo[d]isothiazol-3-yl-pip...)
Affinity DataIC50:  5.80nM. Assay description: In vitro inhibitory activity against [3H]raclopride binding to dopamine receptor D2
In DepthDetails ArticlePubMed