BDBM50051260 2-Amino-N-[4-(4-benzo[d]isothiazol-3-yl-piperazin-1-yl)-butyl]-4-trifluoromethyl-benzamide; hydrochloride::CHEMBL537700
SMILES Nc1cc(ccc1C(=O)NCCCCN1CCN(CC1)c1nsc2ccccc12)C(F)(F)F
InChI Key InChIKey=UXBKOBHMEXWBKP-UHFFFAOYSA-N
Data  2 IC50
  Tab Delimited (TSV)   2D SDfile   Computed 3D by Vconf -m prep SDfile
Find this compound or compounds like it in BindingDB:
Activity Spreadsheet -- Enzyme Inhibition Constant Data from BindingDB
Found 2 hits for monomerid = 50051260
TargetD(2) dopamine receptor(Rattus norvegicus (rat))
Glaxo Wellcome
Curated by ChEMBL
LigandPNGBDBM50051260(2-Amino-N-[4-(4-benzo[d]isothiazol-3-yl-piperazin-...)
Affinity DataIC50:  18nM. Assay description: In vitro inhibitory activity against [3H]raclopride binding to dopamine receptor D2
In DepthDetails ArticlePubMed
Target5-hydroxytryptamine receptor 1A(Rattus norvegicus (rat))
Glaxo Wellcome
Curated by ChEMBL
LigandPNGBDBM50051260(2-Amino-N-[4-(4-benzo[d]isothiazol-3-yl-piperazin-...)
Affinity DataIC50:  12nM. Assay description: In vitro inhibitory activity against [3H]8-OH-DPAT binding to 5-hydroxytryptamine 1A receptor
In DepthDetails ArticlePubMed