BDBM50051344 4-Methoxy-7-((E)-styryl)-furo[3,2-g]chromen-5-one::CHEMBL75590
SMILES COc1c2ccoc2cc2oc(\C=C\c3ccccc3)cc(=O)c12
InChI Key InChIKey=HTBFQFPYNPJVLO-BQYQJAHWSA-N
Data  5 KI
  Tab Delimited (TSV)   2D SDfile   Computed 3D by Vconf -m prep SDfile
Find this compound or compounds like it in BindingDB:
Activity Spreadsheet -- Enzyme Inhibition Constant Data from BindingDB
Found 5 hits for monomerid = 50051344
TargetAdenosine receptor A3(Homo sapiens (Human))
National Institute Of Diabetes
Curated by ChEMBL
LigandPNGBDBM50051344(4-Methoxy-7-((E)-styryl)-furo[3,2-g]chromen-5-one ...)
Affinity DataKi:  8.28E+3nM. Assay description: Binding affinity against human adenosine A3 receptor in HEK293 cells using [125I]-AB-MECA 21680 radioligand.
In DepthDetails ArticlePubMed
TargetAdenosine receptor A3(Homo sapiens (Human))
National Institute Of Diabetes
Curated by ChEMBL
LigandPNGBDBM50051344(4-Methoxy-7-((E)-styryl)-furo[3,2-g]chromen-5-one ...)
Affinity DataKi:  8.32E+3nM. Assay description: Ability to displace [125I]-AB-MECA binding from adenosine A3 receptor.Checked by Author
In DepthDetails ArticlePubMed
TargetAdenosine receptor A2a(Rattus norvegicus (rat))
National Institute Of Diabetes
Curated by ChEMBL
LigandPNGBDBM50051344(4-Methoxy-7-((E)-styryl)-furo[3,2-g]chromen-5-one ...)
Affinity DataKi:  1.15E+4nM. Assay description: Ability to displace [3H]-CGS- 21680 binding from adenosine A2A receptor.Checked by Author
In DepthDetails ArticlePubMed
TargetAdenosine receptor A1(Rattus norvegicus (rat))
National Institute Of Diabetes
Curated by ChEMBL
LigandPNGBDBM50051344(4-Methoxy-7-((E)-styryl)-furo[3,2-g]chromen-5-one ...)
Affinity DataKi:  3.24E+4nM. Assay description: Ability to displace [3H]N6-phenylisopropyladenosine binding from adenosine A1 receptor.Checked by Author
In DepthDetails ArticlePubMed
TargetAdenosine receptor A1(Rattus norvegicus (rat))
National Institute Of Diabetes
Curated by ChEMBL
LigandPNGBDBM50051344(4-Methoxy-7-((E)-styryl)-furo[3,2-g]chromen-5-one ...)
Affinity DataKi:  3.26E+4nM. Assay description: Binding affinity at Adenosine A1 receptor in rat brain membranes by [3H]-PIA displacement.
In DepthDetails ArticlePubMed