BDBM50051359 3,6-Dichloro-2-(2,4,6-trimethyl-phenyl)-chromen-4-one::3,6-dichloro-2-mesityl-4H-chromen-4-one::CHEMBL74248::NSC-74931
SMILES Cc1cc(C)c(c(C)c1)-c1oc2ccc(Cl)cc2c(=O)c1Cl
InChI Key InChIKey=MFVRBRLUUQLTAK-UHFFFAOYSA-N
Data  1 KI
  Tab Delimited (TSV)   2D SDfile   Computed 3D by Vconf -m prep SDfile
Find this compound or compounds like it in BindingDB:
Activity Spreadsheet -- Enzyme Inhibition Constant Data from BindingDB
Found 1 hit for monomerid = 50051359
TargetAdenosine receptor A3(Homo sapiens (Human))
National Institute Of Diabetes
Curated by ChEMBL
LigandPNGBDBM50051359(3,6-Dichloro-2-(2,4,6-trimethyl-phenyl)-chromen-4-...)
Affinity DataKi:  5.24E+3nM. Assay description: Binding affinity against human adenosine A3 receptor in HEK293 cells using [125I]-AB-MECA 21680 radioligand.
In DepthDetails ArticlePubMed