BDBM50051366 (E)-1-((6S,8aS)-6-Hydroxy-5,5,8a-trimethyl-3,5,6,7,8,8a-hexahydro-1H-isoquinolin-2-yl)-5,9-dimethyl-deca-4,8-dien-1-one::CHEMBL308487
SMILES [#6]\[#6](-[#6])=[#6]\[#6]-[#6]\[#6](-[#6])=[#6]\[#6]-[#6]-[#6](=O)-[#7]-1-[#6]-[#6]=[#6]2C([#6])([#6])[#6@@H](-[#8])-[#6]-[#6][C@]2([#6])[#6]-1
InChI Key InChIKey=NFBITTUBOCRWPW-IMGQQDLPSA-N
Data  1 IC50
  Tab Delimited (TSV)   2D SDfile   Computed 3D by Vconf -m prep SDfile
Find this compound or compounds like it in BindingDB:
Activity Spreadsheet -- Enzyme Inhibition Constant Data from BindingDB
Found 1 hit for monomerid = 50051366
TargetLanosterol synthase(Rattus norvegicus)
Laboratoires Fournier
Curated by ChEMBL
LigandPNGBDBM50051366((E)-1-((6S,8aS)-6-Hydroxy-5,5,8a-trimethyl-3,5,6,7...)
Affinity DataIC50:  680nM. Assay description: Inhibitory activity against Oxidosqualene-lanosterol cyclase from Rat liver microsomes
In DepthDetails ArticlePubMed