BDBM50051585 CHEMBL2369127::[des-His1,Tyr5,Glu9,(2S,3R)-beta-MePhe10]glucagon-NH2
SMILES CSCC[C@H](NC(=O)[C@H](CC(C)C)NC(=O)[C@H](Cc1c[nH]c2ccccc12)NC(=O)[C@H](CCC(N)=O)NC(=O)[C@@H](NC(=O)[C@H](Cc1ccccc1)NC(=O)[C@H](CC(O)=O)NC(=O)[C@H](CCC(N)=O)NC(=O)[C@H](C)NC(=O)[C@H](CCCNC(N)=N)NC(=O)[C@H](CCCNC(N)=N)NC(=O)[C@H](CO)NC(=O)[C@H](CC(O)=O)NC(=O)[C@H](CC(C)C)NC(=O)[C@H](Cc1ccc(O)cc1)NC(=O)[C@H](CCCCN)NC(=O)[C@H](CO)NC(=O)[C@@H](NC(=O)[C@@H](CCC(O)=O)NC(=O)[C@H](CO)NC(=O)[C@@H](NC(=O)[C@H](Cc1ccccc1)NC(=O)[C@H](Cc1ccc(O)cc1)NC(=O)CNC(=O)[C@H](CCC(N)=O)NC(=O)[C@@H](N)CO)[C@@H](C)O)C(C)c1ccccc1)C(C)C)C(=O)N[C@@H](CC(N)=O)C(=O)N[C@@H](C(C)O)C(N)=O
InChI Key InChIKey=SNCODYSDFYHLPQ-WFHZPOCISA-N
Data  1 IC50
  Tab Delimited (TSV)   2D SDfile   Computed 3D by Vconf -m prep SDfile
Find this compound or compounds like it in BindingDB:
Activity Spreadsheet -- Enzyme Inhibition Constant Data from BindingDB
Found 1 hit for monomerid = 50051585
TargetGlucagon receptor(Rattus norvegicus)
University Of Arizona
Curated by ChEMBL
LigandPNGBDBM50051585(CHEMBL2369127 | [des-His1,Tyr5,Glu9,(2S,3R)-beta-M...)
Affinity DataIC50:  74nM. Assay description: Inhibition of [125I]glucagon binding towards Glucagon receptor
In DepthDetails ArticlePubMed