BDBM50051668 2-(3,4-Dichloro-phenyl)-5,6-dimethyl-7-((S)-1-phenyl-ethyl)-7H-pyrrolo[2,3-d]pyrimidin-4-ylamine::CHEMBL311341
SMILES C[C@@H](c1ccccc1)n1c(C)c(C)c2c(N)nc(nc12)-c1ccc(Cl)c(Cl)c1
InChI Key InChIKey=DVSGSWIPTYTWPR-AWEZNQCLSA-N
Data  2 KI
  Tab Delimited (TSV)   2D SDfile   Computed 3D by Vconf -m prep SDfile
Find this compound or compounds like it in BindingDB:
Activity Spreadsheet -- Enzyme Inhibition Constant Data from BindingDB
Found 2 hits for monomerid = 50051668
TargetAdenosine receptor A1(Rattus norvegicus (rat))
Julius-Maximilians-UniversitäT WüRzburg
Curated by ChEMBL
LigandPNGBDBM50051668(2-(3,4-Dichloro-phenyl)-5,6-dimethyl-7-((S)-1-phen...)
Affinity DataKi:  1.80E+3nM. Assay description: Radioligand binding assay for [3H]-PIA affinity towards Adenosine A1 receptor of rat cerebral cortical membrane
In DepthDetails ArticlePubMed
TargetAdenosine receptor A2a(Rattus norvegicus (rat))
Julius-Maximilians-UniversitäT WüRzburg
Curated by ChEMBL
LigandPNGBDBM50051668(2-(3,4-Dichloro-phenyl)-5,6-dimethyl-7-((S)-1-phen...)
Affinity DataKi:  3.00E+4nM. Assay description: Radioligand binding assay for [3H]-NECA affinity towards adenosine A2A receptor of rat striatum
In DepthDetails ArticlePubMed