BDBM50051752 1-(3-p-Tolyl-8-aza-bicyclo[3.2.1]oct-2-yl)-propan-1-one::CHEMBL87983
SMILES CCC(=O)C1C2CCC(CC1c1ccc(C)cc1)N2
InChI Key InChIKey=BUPHBAAVPSQWDR-UHFFFAOYSA-N
Data  2 KI  1 IC50
  Tab Delimited (TSV)   2D SDfile   Computed 3D by Vconf -m prep SDfile
Find this compound or compounds like it in BindingDB:
Activity Spreadsheet -- Enzyme Inhibition Constant Data from BindingDB
Found 3 hits for monomerid = 50051752
TargetTransporter(Rattus norvegicus)
State University Of New York
Curated by ChEMBL
LigandPNGBDBM50051752(1-(3-p-Tolyl-8-aza-bicyclo[3.2.1]oct-2-yl)-propan-...)
Affinity DataKi:  5.5nM. Assay description: Displacement of [3H]-nisoxatine from Norepinephrine transporter of rat forebrain membrane
In DepthDetails ArticlePubMed
TargetSodium-dependent serotonin transporter(Rattus norvegicus (rat))
State University Of New York
Curated by ChEMBL
LigandPNGBDBM50051752(1-(3-p-Tolyl-8-aza-bicyclo[3.2.1]oct-2-yl)-propan-...)
Affinity DataKi:  19nM. Assay description: Displacement of [3H]-paroxetine from Serotonin transporter of rat frontal cortex membrane
In DepthDetails ArticlePubMed
TargetSodium-dependent dopamine transporter(Rattus norvegicus (rat))
State University Of New York
Curated by ChEMBL
LigandPNGBDBM50051752(1-(3-p-Tolyl-8-aza-bicyclo[3.2.1]oct-2-yl)-propan-...)
Affinity DataIC50:  4.70nM. Assay description: Displacement of [125I]-RTI-55 from dopamine transporter of rat brain membranes
In DepthDetails ArticlePubMed