BDBM50051825 CHEMBL27141::[(S)-4-((R)-2-Amino-3-mercapto-propyl)-3-(2-cyclopropoxy-ethyl)-piperazin-1-yl]-naphthalen-1-yl-methanone
SMILES N[C@@H](CS)CN1CCN(C[C@@H]1CCOC1CC1)C(=O)c1cccc2ccccc12
InChI Key InChIKey=GYHJYVOLUAYUGE-MOPGFXCFSA-N
Data  2 IC50
  Tab Delimited (TSV)   2D SDfile   Computed 3D by Vconf -m prep SDfile
Find this compound or compounds like it in BindingDB:
Activity Spreadsheet -- Enzyme Inhibition Constant Data from BindingDB
Found 2 hits for monomerid = 50051825
TargetProtein farnesyltransferase subunit beta/geranylgeranyltransferase type-1 subunit alpha(Rattus norvegicus)
Merck Research Laboratories
Curated by ChEMBL
LigandPNGBDBM50051825(CHEMBL27141 | [(S)-4-((R)-2-Amino-3-mercapto-propy...)
Affinity DataIC50:  500nM. Assay description: Inhibition of post-traslational processing of Ras protein in RAT1 cell line
In DepthDetails ArticlePubMed
TargetDimer of Protein farnesyltransferase subunit beta(Homo sapiens (Human))
Merck Research Laboratories
Curated by ChEMBL
LigandPNGBDBM50051825(CHEMBL27141 | [(S)-4-((R)-2-Amino-3-mercapto-propy...)
Affinity DataIC50:  1nM. Assay description: Inhibition of [3H]-FPP incorporation into Ha-Ras by Farnesyltransferase
In DepthDetails ArticlePubMed