BDBM50051923 2,4-DIAMINO-6-[N-(3',5'-DIMETHOXYBENZYL)-N-METHYLAMINO]PYRIDO[2,3-D]PYRIMIDINE::CHEMBL36245::N*6*-(3,5-Dimethoxy-benzyl)-N*6*-methyl-pyrido[2,3-d]pyrimidine-2,4,6-triamine
SMILES COc1cc(CN(C)c2cnc3nc(N)nc(N)c3c2)cc(OC)c1
InChI Key InChIKey=XWCCXDBXMCTZPW-UHFFFAOYSA-N
Data  10 IC50
PDB links: 1 PDB ID matches this monomer.
  Tab Delimited (TSV)   2D SDfile   Computed 3D by Vconf -m prep SDfile
Find this compound or compounds like it in BindingDB:
Activity Spreadsheet -- Enzyme Inhibition Constant Data from BindingDB
Found 10 hits for monomerid = 50051923
TargetBifunctional dihydrofolate reductase-thymidylate synthase(Toxoplasma gondii)
Duquesne University
Curated by ChEMBL
LigandPNGBDBM50051923(2,4-DIAMINO-6-[N-(3',5'-DIMETHOXYBENZYL)-N-METHYLA...)
Affinity DataIC50:  21nM. Assay description: Inhibitory activity against Toxoplasma gondii dihydrofolate reductase (in 90 microM dihydrofolic acid)
In DepthDetails ArticlePubMed
TargetBifunctional dihydrofolate reductase-thymidylate synthase(Toxoplasma gondii)
Duquesne University
Curated by ChEMBL
LigandPNGBDBM50051923(2,4-DIAMINO-6-[N-(3',5'-DIMETHOXYBENZYL)-N-METHYLA...)
Affinity DataIC50:  29nM. Assay description: Inhibitory activity against Dihydrofolate reductase from Toxoplasma gondii (tgDHFR)
In DepthDetails ArticlePubMed
TargetDihydrofolate reductase(Rattus norvegicus (rat))
Duquesne University
Curated by ChEMBL
LigandPNGBDBM50051923(2,4-DIAMINO-6-[N-(3',5'-DIMETHOXYBENZYL)-N-METHYLA...)
Affinity DataIC50:  72nM. Assay description: Inhibitory activity against rat liver dihydrofolate reductase (in 90 microM dihydrofolic acid)
In DepthDetails ArticlePubMed
TargetDihydrofolate reductase(Pneumocystis carinii)
Duquesne University
Curated by ChEMBL
LigandPNGBDBM50051923(2,4-DIAMINO-6-[N-(3',5'-DIMETHOXYBENZYL)-N-METHYLA...)
Affinity DataIC50:  76nM. Assay description: Inhibitory activity against Pneumocystis carinii dihydrofolate reductase (in 90 microM dihydrofolic acid)
TargetBifunctional dihydrofolate reductase-thymidylate synthase(Toxoplasma gondii)
Duquesne University
Curated by ChEMBL
LigandPNGBDBM50051923(2,4-DIAMINO-6-[N-(3',5'-DIMETHOXYBENZYL)-N-METHYLA...)
Affinity DataIC50:  31nM. Assay description: Inhibition of Toxoplasma gondii dihydrofolate reductase
In DepthDetails ArticlePubMed
TargetBifunctional dihydrofolate reductase-thymidylate synthase(Toxoplasma gondii)
Duquesne University
Curated by ChEMBL
LigandPNGBDBM50051923(2,4-DIAMINO-6-[N-(3',5'-DIMETHOXYBENZYL)-N-METHYLA...)
Affinity DataIC50:  29nM. Assay description: Inhibitory activity of the compound against Toxoplasma gondii dihydrofolate reductase (in 50 microM dihydrofolic acid)
In DepthDetails ArticlePubMed
TargetDihydrofolate reductase(Homo sapiens (Human))
Duquesne University
Curated by ChEMBL
LigandPNGBDBM50051923(2,4-DIAMINO-6-[N-(3',5'-DIMETHOXYBENZYL)-N-METHYLA...)
Affinity DataIC50:  2.90E+3nM. Assay description: Inhibitory activity against Dihydrofolate reductase from recombinant human (hDHFR)
In DepthDetails ArticlePubMed
TargetDihydrofolate reductase(Pneumocystis carinii)
Duquesne University
Curated by ChEMBL
LigandPNGBDBM50051923(2,4-DIAMINO-6-[N-(3',5'-DIMETHOXYBENZYL)-N-METHYLA...)
Affinity DataIC50:  76nM. Assay description: Inhibition of Pneumocystis carinii dihydrofolate reductase
TargetDihydrofolate reductase(Rattus norvegicus (rat))
Duquesne University
Curated by ChEMBL
LigandPNGBDBM50051923(2,4-DIAMINO-6-[N-(3',5'-DIMETHOXYBENZYL)-N-METHYLA...)
Affinity DataIC50:  72nM. Assay description: Inhibition of rat liver dihydrofolate reductase
In DepthDetails ArticlePubMed
TargetDihydrofolate reductase(Homo sapiens (Human))
Duquesne University
Curated by ChEMBL
LigandPNGBDBM50051923(2,4-DIAMINO-6-[N-(3',5'-DIMETHOXYBENZYL)-N-METHYLA...)
Affinity DataIC50:  2.90E+3nM. Assay description: Inhibitory activity against recombinant human dihydrofolate reductase(in 50 microM dihydrofolic acid)
In DepthDetails ArticlePubMed