BDBM50051969 CHEMBL289225::N-[3-(4-Methyl-piperazin-1-yl)-propyl]-2,2-diphenyl-acetamide
SMILES CN1CCN(CCCNC(=O)C(c2ccccc2)c2ccccc2)CC1
InChI Key InChIKey=CFFCAXIXEXOVJJ-UHFFFAOYSA-N
Data  1 IC50
  Tab Delimited (TSV)   2D SDfile   Computed 3D by Vconf -m prep SDfile
Find this compound or compounds like it in BindingDB:
Activity Spreadsheet -- Enzyme Inhibition Constant Data from BindingDB
Found 1 hit for monomerid = 50051969
TargetSodium channel protein type 2 subunit alpha(Rattus norvegicus)
Warner-Lambert
Curated by ChEMBL
LigandPNGBDBM50051969(CHEMBL289225 | N-[3-(4-Methyl-piperazin-1-yl)-prop...)
Affinity DataIC50: >2.00E+5nM. Assay description: Inhibitory activity against type IIA sodium channel in CNaIIA-1 cell line expressed in CHO cells
In DepthDetails ArticlePubMed