BDBM50051973 CHEMBL39907::N-[3-(4-Phenoxy-piperidin-1-yl)-propyl]-2,2-diphenyl-acetamide
SMILES O=C(NCCCN1CCC(CC1)Oc1ccccc1)C(c1ccccc1)c1ccccc1
InChI Key InChIKey=VAWXZCMJLUIOCS-UHFFFAOYSA-N
Data  1 IC50
  Tab Delimited (TSV)   2D SDfile   Computed 3D by Vconf -m prep SDfile
Find this compound or compounds like it in BindingDB:
Activity Spreadsheet -- Enzyme Inhibition Constant Data from BindingDB
Found 1 hit for monomerid = 50051973
TargetSodium channel protein type 2 subunit alpha(Rattus norvegicus)
Warner-Lambert
Curated by ChEMBL
LigandPNGBDBM50051973(CHEMBL39907 | N-[3-(4-Phenoxy-piperidin-1-yl)-prop...)
Affinity DataIC50:  1.40E+3nM. Assay description: Inhibitory activity against type IIA sodium channel in CNaIIA-1 cell line expressed in CHO cells
In DepthDetails ArticlePubMed