BDBM50051975 CHEMBL40106::N-[3-(2,6-Dimethyl-morpholin-4-yl)-propyl]-2,2-diphenyl-acetamide
SMILES CC1CN(CCCNC(=O)C(c2ccccc2)c2ccccc2)CC(C)O1
InChI Key InChIKey=ZSUNVEQGHLEGIL-UHFFFAOYSA-N
Data  1 IC50
  Tab Delimited (TSV)   2D SDfile   Computed 3D by Vconf -m prep SDfile
Find this compound or compounds like it in BindingDB:
Activity Spreadsheet -- Enzyme Inhibition Constant Data from BindingDB
Found 1 hit for monomerid = 50051975
TargetSodium channel protein type 2 subunit alpha(Rattus norvegicus)
Warner-Lambert
Curated by ChEMBL
LigandPNGBDBM50051975(CHEMBL40106 | N-[3-(2,6-Dimethyl-morpholin-4-yl)-p...)
Affinity DataIC50:  2.70E+3nM. Assay description: Inhibitory activity against type IIA sodium channel in CNaIIA-1 cell line expressed in CHO cells
In DepthDetails ArticlePubMed