BDBM50051977 2,2-Diphenyl-N-(2-piperidin-1-yl-ethyl)-acetamide::CHEMBL40061
SMILES O=C(NCCN1CCCCC1)C(c1ccccc1)c1ccccc1
InChI Key InChIKey=MWYOFPSSMVPDDI-UHFFFAOYSA-N
Data  1 IC50
  Tab Delimited (TSV)   2D SDfile   Computed 3D by Vconf -m prep SDfile
Find this compound or compounds like it in BindingDB:
Activity Spreadsheet -- Enzyme Inhibition Constant Data from BindingDB
Found 1 hit for monomerid = 50051977
TargetSodium channel protein type 2 subunit alpha(Rattus norvegicus)
Warner-Lambert
Curated by ChEMBL
LigandPNGBDBM50051977(2,2-Diphenyl-N-(2-piperidin-1-yl-ethyl)-acetamide ...)
Affinity DataIC50:  7.20E+3nM. Assay description: Inhibitory activity against type IIA sodium channel in CNaIIA-1 cell line expressed in CHO cells
In DepthDetails ArticlePubMed