BDBM50051982 CHEMBL288029::N-(3-Morpholin-4-yl-propyl)-2,2-diphenyl-acetamide
SMILES O=C(NCCCN1CCOCC1)C(c1ccccc1)c1ccccc1
InChI Key InChIKey=ZUTYZCNYTDXKPB-UHFFFAOYSA-N
Data  1 IC50
  Tab Delimited (TSV)   2D SDfile   Computed 3D by Vconf -m prep SDfile
Find this compound or compounds like it in BindingDB:
Activity Spreadsheet -- Enzyme Inhibition Constant Data from BindingDB
Found 1 hit for monomerid = 50051982
TargetSodium channel protein type 2 subunit alpha(Rattus norvegicus)
Warner-Lambert
Curated by ChEMBL
LigandPNGBDBM50051982(CHEMBL288029 | N-(3-Morpholin-4-yl-propyl)-2,2-dip...)
Affinity DataIC50:  6.50E+3nM. Assay description: Inhibitory activity against type IIA sodium channel in CNaIIA-1 cell line expressed in CHO cells
In DepthDetails ArticlePubMed