BDBM50051985 CHEMBL288826::N-[3-(4-Benzyl-piperidin-1-yl)-propyl]-2,2-diphenyl-acetamide
SMILES O=C(NCCCN1CCC(Cc2ccccc2)CC1)C(c1ccccc1)c1ccccc1
InChI Key InChIKey=DKXNWXXUHISEHY-UHFFFAOYSA-N
Data  7 IC50
  Tab Delimited (TSV)   2D SDfile   Computed 3D by Vconf -m prep SDfile
Find this compound or compounds like it in BindingDB:
Activity Spreadsheet -- Enzyme Inhibition Constant Data from BindingDB
Found 7 hits for monomerid = 50051985
TargetSodium channel protein type 2 subunit alpha(Rattus norvegicus)
Warner-Lambert
Curated by ChEMBL
LigandPNGBDBM50051985(CHEMBL288826 | N-[3-(4-Benzyl-piperidin-1-yl)-prop...)
Affinity DataIC50:  600nM. Assay description: Inhibitory activity against type IIA sodium channel in CNaIIA-1 cell line expressed in CHO cells
In DepthDetails ArticlePubMed
TargetSodium-dependent serotonin transporter(Homo sapiens (Human))
Chonnam National University
Curated by ChEMBL
LigandPNGBDBM50051985(CHEMBL288826 | N-[3-(4-Benzyl-piperidin-1-yl)-prop...)
Affinity DataIC50: >1.00E+4nM. Assay description: Inhibition of [3H]-5-hydroxytryptamine reuptake in human SERT expressed in HEK293 cells by microbeta liquid scintillation counting method
In DepthDetails ArticlePubMed
TargetSodium-dependent noradrenaline transporter(Homo sapiens (Human))
Chonnam National University
Curated by ChEMBL
LigandPNGBDBM50051985(CHEMBL288826 | N-[3-(4-Benzyl-piperidin-1-yl)-prop...)
Affinity DataIC50:  2.21E+3nM. Assay description: Inhibition of [3H]-5-norepinephrine reuptake in human NET expressed in HEK293 cells by microbeta liquid scintillation counting method
In DepthDetails ArticlePubMed
TargetSodium-dependent serotonin transporter(Homo sapiens (Human))
Chonnam National University
Curated by ChEMBL
LigandPNGBDBM50051985(CHEMBL288826 | N-[3-(4-Benzyl-piperidin-1-yl)-prop...)
Affinity DataIC50: >1.00E+4nM. Assay description: Inhibition of [3H]serotonin uptake at SERT (unknown origin)
In DepthDetails ArticlePubMed
TargetSodium-dependent dopamine transporter(Homo sapiens (Human))
Chonnam National University
Curated by ChEMBL
LigandPNGBDBM50051985(CHEMBL288826 | N-[3-(4-Benzyl-piperidin-1-yl)-prop...)
Affinity DataIC50:  1.07E+3nM. Assay description: Inhibition of [3H]dopamine uptake at DAT (unknown origin)
In DepthDetails ArticlePubMed
TargetSodium-dependent noradrenaline transporter(Homo sapiens (Human))
Chonnam National University
Curated by ChEMBL
LigandPNGBDBM50051985(CHEMBL288826 | N-[3-(4-Benzyl-piperidin-1-yl)-prop...)
Affinity DataIC50:  2.21E+3nM. Assay description: Inhibition of [3H]norepinephrine uptake at NET (unknown origin)
In DepthDetails ArticlePubMed
TargetSodium-dependent dopamine transporter(Homo sapiens (Human))
Chonnam National University
Curated by ChEMBL
LigandPNGBDBM50051985(CHEMBL288826 | N-[3-(4-Benzyl-piperidin-1-yl)-prop...)
Affinity DataIC50:  1.07E+3nM. Assay description: Inhibition of yeast Farnesyl transferase
In DepthDetails ArticlePubMed