BDBM50052187 CHEMBL95096::N-((S)-1-Benzyl-pyrrolidin-3-yl)-5-chloro-4-(cyclohexanecarbonyl-amino)-2-methoxy-benzamide
SMILES COc1cc(NC(=O)C2CCCCC2)c(Cl)cc1C(=O)N[C@H]1CCN(Cc2ccccc2)C1
InChI Key InChIKey=WBQWTTNQBIPRBR-FQEVSTJZSA-N
Data  3 KI
  Tab Delimited (TSV)   2D SDfile   Computed 3D by Vconf -m prep SDfile
Find this compound or compounds like it in BindingDB:
Activity Spreadsheet -- Enzyme Inhibition Constant Data from BindingDB
Found 3 hits for monomerid = 50052187
TargetD(4) dopamine receptor(Homo sapiens (Human))
Yamanouchi Pharmaceutical
Curated by ChEMBL
LigandPNGBDBM50052187(CHEMBL95096 | N-((S)-1-Benzyl-pyrrolidin-3-yl)-5-c...)
Affinity DataKi:  110nM. Assay description: Binding affinity to Human Dopamine receptor D4 expressed in CHO cells was determined using [3H]- nemonapride as radioligand
In DepthDetails ArticlePubMed
TargetD(3) dopamine receptor(Rattus norvegicus (Rat))
Yamanouchi Pharmaceutical
Curated by ChEMBL
LigandPNGBDBM50052187(CHEMBL95096 | N-((S)-1-Benzyl-pyrrolidin-3-yl)-5-c...)
Affinity DataKi:  200nM. Assay description: Binding affinity of the compound to rat Dopamine receptor D3 expressed in CHO cells was determined using [125 I] iodosulpride as radioligand
In DepthDetails ArticlePubMed
TargetD(2) dopamine receptor(Rattus norvegicus (rat))
Yamanouchi Pharmaceutical
Curated by ChEMBL
LigandPNGBDBM50052187(CHEMBL95096 | N-((S)-1-Benzyl-pyrrolidin-3-yl)-5-c...)
Affinity DataKi:  1.20E+3nM. Assay description: Binding affinity to rat Dopamine receptor D2 expressesd in CHO cells was determined using [125 I ] iodosulpride as radioligand
In DepthDetails ArticlePubMed