BDBM50052404 CHEMBL3318480
SMILES OC1=C(Sc2ccccc2C#N)C(=O)CC(C1)c1ccc(Cl)cc1
InChI Key InChIKey=RPWVQVUPERVHJQ-UHFFFAOYSA-N
Data  2 IC50
  Tab Delimited (TSV)   2D SDfile   Computed 3D by Vconf -m prep SDfile
Find this compound or compounds like it in BindingDB:
Activity Spreadsheet -- Enzyme Inhibition Constant Data from BindingDB
Found 2 hits for monomerid = 50052404
TargetL-lactate dehydrogenase A chain(Homo sapiens (Human))
Genentech
Curated by ChEMBL
LigandPNGBDBM50052404(CHEMBL3318480)
Affinity DataIC50: >1.00E+5nM. Assay description: Inhibition of human recombinant carboxy-terminal His-tagged LDHA by UV endpoint assay
In DepthDetails ArticlePubMed
TargetL-lactate dehydrogenase B chain(Homo sapiens (Human))
Genentech
Curated by ChEMBL
LigandPNGBDBM50052404(CHEMBL3318480)
Affinity DataIC50: >1.00E+4nM. Assay description: Inhibition of human recombinant carboxy-terminal His-tagged LDHB by UV endpoint assay
In DepthDetails ArticlePubMed