BDBM50053354 (E)-3-{6-(2,6-Dichloro-phenylsulfanylmethyl)-3-[2-(4-methoxy-phenyl)-ethoxy]-pyridin-2-yl}-acrylic acid::CHEMBL127913
SMILES COc1ccc(CCOc2ccc(CSc3c(Cl)cccc3Cl)nc2\C=C\C(O)=O)cc1
InChI Key InChIKey=ZMIXFFNMHGAAHI-ZRDIBKRKSA-N
Data  1 KI
  Tab Delimited (TSV)   2D SDfile   Computed 3D by Vconf -m prep SDfile
Find this compound or compounds like it in BindingDB:
Activity Spreadsheet -- Enzyme Inhibition Constant Data from BindingDB
Found 1 hit for monomerid = 50053354
TargetLeukotriene B4 receptor 1(Homo sapiens (Human))
Smithkline Beecham Pharmaceuticals
Curated by ChEMBL
LigandPNGBDBM50053354((E)-3-{6-(2,6-Dichloro-phenylsulfanylmethyl)-3-[2-...)
Affinity DataKi:  1.20nM. Assay description: Inhibition of [3H]-LTB4 binding to human neutrophils
In DepthDetails ArticlePubMed