BDBM50053574 CHEMBL3326373
SMILES CCn1c(=O)c(C=O)c(N)n(C2CC2)c1=O
InChI Key InChIKey=PCJIUTNPQFYPGS-UHFFFAOYSA-N
Data  1 IC50
  Tab Delimited (TSV)   2D SDfile   Computed 3D by Vconf -m prep SDfile
Find this compound or compounds like it in BindingDB:
Activity Spreadsheet -- Enzyme Inhibition Constant Data from BindingDB
Found 1 hit for monomerid = 50053574
TargetEukaryotic elongation factor 2 kinase(Homo sapiens (Human))
The University Of Texas At Austin
Curated by ChEMBL
LigandPNGBDBM50053574(CHEMBL3326373)
Affinity DataIC50: >2.50E+4nM. Assay description: Inhibition of human recombinant eEF-2K expressed in bacteria pre-incubated for 30 mins before adding peptide substrate and [gamma32P]ATP by scintilla...
In DepthDetails ArticlePubMed