BDBM50053600 (3-Chloro-phenyl)-urea::CHEMBL131289
SMILES NC(=O)Nc1cccc(Cl)c1
InChI Key InChIKey=PPCUBWWPGYHEJE-UHFFFAOYSA-N
Data  1 KI
  Tab Delimited (TSV)   2D SDfile   Computed 3D by Vconf -m prep SDfile
Find this compound or compounds like it in BindingDB:
Activity Spreadsheet -- Enzyme Inhibition Constant Data from BindingDB
Found 1 hit for monomerid = 50053600
Target5-hydroxytryptamine receptor 3A/3B/3C/3D/3E(Homo sapiens (Human))
Virginia Commonwealth University
Curated by ChEMBL
LigandPNGBDBM50053600((3-Chloro-phenyl)-urea | CHEMBL131289)
Affinity DataKi: >1.00E+4nM. Assay description: Compound was tested for the inhibition of [3H]-GR-65,630 binding to 5-hydroxytryptamine 3 receptor expressed in NG 108-15 cells
In DepthDetails ArticlePubMed