BDBM50053648 (R)-3-(4-Ethyl-phenyl)-8-aza-bicyclo[3.2.1]octane-2-carboxylic acid methyl ester::3-(4-Ethyl-phenyl)-8-aza-bicyclo[3.2.1]octane-2-carboxylic acid methyl ester::CHEMBL340523
SMILES CCc1ccc(cc1)C1CC2CCC(N2)C1C(=O)OC
InChI Key InChIKey=VQVUZWDWIQWSQU-UHFFFAOYSA-N
Data  6 IC50
  Tab Delimited (TSV)   2D SDfile   Computed 3D by Vconf -m prep SDfile
Find this compound or compounds like it in BindingDB:
Activity Spreadsheet -- Enzyme Inhibition Constant Data from BindingDB
Found 6 hits for monomerid = 50053648
TargetSodium-dependent serotonin transporter(Rattus norvegicus (rat))
Research Triangle Institute
Curated by ChEMBL
LigandPNGBDBM50053648((R)-3-(4-Ethyl-phenyl)-8-aza-bicyclo[3.2.1]octane-...)
Affinity DataIC50:  8.10nM. Assay description: Inhibition of [3H]paroxetine binding to serotonin transporter in rat frontal cortex
In DepthDetails ArticlePubMed
TargetTransporter(Rattus norvegicus)
Research Triangle Institute
Curated by ChEMBL
LigandPNGBDBM50053648((R)-3-(4-Ethyl-phenyl)-8-aza-bicyclo[3.2.1]octane-...)
Affinity DataIC50:  122nM. Assay description: Inhibition of [3H]nisoxetine binding to the norepinephrine transporter in rat midbrain.
In DepthDetails ArticlePubMed
TargetSodium-dependent serotonin transporter(Rattus norvegicus (rat))
Research Triangle Institute
Curated by ChEMBL
LigandPNGBDBM50053648((R)-3-(4-Ethyl-phenyl)-8-aza-bicyclo[3.2.1]octane-...)
Affinity DataIC50:  8.10nM. Assay description: In vitro inhibitory activity against radioligand [3H]paroxetine binding to serotonin transporter (5-HTT) in rat midbrain tissue
In DepthDetails ArticlePubMed
TargetTransporter(Rattus norvegicus)
Research Triangle Institute
Curated by ChEMBL
LigandPNGBDBM50053648((R)-3-(4-Ethyl-phenyl)-8-aza-bicyclo[3.2.1]octane-...)
Affinity DataIC50:  122nM. Assay description: In vitro inhibitory activity against radioligand [3H]-nisoxatine binding to norepinephrine transporter (NET) in rat cortical tissue
In DepthDetails ArticlePubMed
TargetSodium-dependent dopamine transporter(Rattus norvegicus (rat))
Research Triangle Institute
Curated by ChEMBL
LigandPNGBDBM50053648((R)-3-(4-Ethyl-phenyl)-8-aza-bicyclo[3.2.1]octane-...)
Affinity DataIC50:  50nM. Assay description: In vitro inhibitory activity against radioligand [3H]-WN 35,428 binding to dopamine transporter (DAT) in rat striatal tissue
In DepthDetails ArticlePubMed
TargetSodium-dependent dopamine transporter(Rattus norvegicus (rat))
Research Triangle Institute
Curated by ChEMBL
LigandPNGBDBM50053648((R)-3-(4-Ethyl-phenyl)-8-aza-bicyclo[3.2.1]octane-...)
Affinity DataIC50:  50nM. Assay description: Inhibition of [3H]WIN-35428 binding to the dopamine transporter in rat striata.
In DepthDetails ArticlePubMed