BDBM50053713 3-[4-(4-Isoquinolin-3-yl-piperazin-1-yl)-butyl]-5,5-dimethyl-thiazolidin-4-one::CHEMBL130489
SMILES CC1(C)SCN(CCCCN2CCN(CC2)c2cc3ccccc3cn2)C1=O
InChI Key InChIKey=FBYKATSGAJCQQW-UHFFFAOYSA-N
Data  2 IC50
  Tab Delimited (TSV)   2D SDfile   Computed 3D by Vconf -m prep SDfile
Find this compound or compounds like it in BindingDB:
Activity Spreadsheet -- Enzyme Inhibition Constant Data from BindingDB
Found 2 hits for monomerid = 50053713
TargetD(2) dopamine receptor(Rattus norvegicus (rat))
Hoechst Marion Roussel
Curated by ChEMBL
LigandPNGBDBM50053713(3-[4-(4-Isoquinolin-3-yl-piperazin-1-yl)-butyl]-5,...)
Affinity DataIC50:  8.43E+3nM. Assay description: Binding affinity towards Dopamine receptor D2 was determined in rat striatum using [3H]- spiperone as radioligand
In DepthDetails ArticlePubMed
Target5-hydroxytryptamine receptor 1A(Rattus norvegicus (rat))
Hoechst Marion Roussel
Curated by ChEMBL
LigandPNGBDBM50053713(3-[4-(4-Isoquinolin-3-yl-piperazin-1-yl)-butyl]-5,...)
Affinity DataIC50:  629nM. Assay description: Binding affinity towards serotonin 5-HT1A receptor was determined in rat hippocampus using [3H]8-OH-DPAT as ligand
In DepthDetails ArticlePubMed