BDBM50053719 2,2-Dimethyl-3-{4-[4-(3-trifluoromethyl-phenyl)-piperazin-1-yl]-butyl}-thiazolidin-4-one::CHEMBL334585
SMILES CC1(C)SCC(=O)N1CCCCN1CCN(CC1)c1cccc(c1)C(F)(F)F
InChI Key InChIKey=VHBJVHRRBQCXMZ-UHFFFAOYSA-N
Data  1 IC50
  Tab Delimited (TSV)   2D SDfile   Computed 3D by Vconf -m prep SDfile
Find this compound or compounds like it in BindingDB:
Activity Spreadsheet -- Enzyme Inhibition Constant Data from BindingDB
Found 1 hit for monomerid = 50053719
TargetD(2) dopamine receptor(Rattus norvegicus (rat))
Hoechst Marion Roussel
Curated by ChEMBL
LigandPNGBDBM50053719(2,2-Dimethyl-3-{4-[4-(3-trifluoromethyl-phenyl)-pi...)
Affinity DataIC50:  1.13E+3nM. Assay description: Binding affinity towards Dopamine receptor D2 was determined in rat striatum using [3H]- spiperone as radioligand
In DepthDetails ArticlePubMed