BDBM50053884 Allyl-(1-allyl-6-{4-[(10,11-dihydro-5H-dibenzo[a,d]cyclohepten-5-ylmethyl)-amino]-piperidin-1-yl}-1H-pyrazolo[3,4-d]pyrimidin-4-yl)-amine::CHEMBL133458
SMILES C=CCNc1nc(nc2n(CC=C)ncc12)N1CCC(CC1)NCC1c2ccccc2CCc2ccccc12
InChI Key InChIKey=YAXXKLQEHSZBIZ-UHFFFAOYSA-N
Data  1 KI
  Tab Delimited (TSV)   2D SDfile   Computed 3D by Vconf -m prep SDfile
Find this compound or compounds like it in BindingDB:
Activity Spreadsheet -- Enzyme Inhibition Constant Data from BindingDB
Found 1 hit for monomerid = 50053884
TargetVoltage-dependent L-type calcium channel subunit alpha-1S(Rattus norvegicus)
Institut De Recherches Servier
Curated by ChEMBL
LigandPNGBDBM50053884(Allyl-(1-allyl-6-{4-[(10,11-dihydro-5H-dibenzo[a,d...)
Affinity DataKi:  270nM. Assay description: Inhibition of [3H]-D-888 binding to L-type [Ca2+] channel of membranes from rat skeletal muscle
In DepthDetails ArticlePubMed