BDBM50053898 Allyl-(9-allyl-6-{4-[(8-chloro-11-methyl-10,10-dioxo-10,11-dihydro-5H-10lambda*6*-thia-11-aza-dibenzo[a,d]cyclohepten-5-ylmethyl)-amino]-piperidin-1-yl}-9H-purin-2-yl)-amine::CHEMBL133118
SMILES CN1c2ccccc2C(CNC2CCN(CC2)c2nc(NCC=C)nc3n(CC=C)cnc23)c2ccc(Cl)cc2S1(=O)=O
InChI Key InChIKey=VDEZFHFFESVMPI-UHFFFAOYSA-N
Data  1 KI
  Tab Delimited (TSV)   2D SDfile   Computed 3D by Vconf -m prep SDfile
Find this compound or compounds like it in BindingDB:
Activity Spreadsheet -- Enzyme Inhibition Constant Data from BindingDB
Found 1 hit for monomerid = 50053898
TargetVoltage-dependent L-type calcium channel subunit alpha-1S(Rattus norvegicus)
Institut De Recherches Servier
Curated by ChEMBL
LigandPNGBDBM50053898(Allyl-(9-allyl-6-{4-[(8-chloro-11-methyl-10,10-dio...)
Affinity DataKi:  170nM. Assay description: Inhibition of [3H]-D-888 binding to L-type [Ca2+] channel of membranes from rat skeletal muscle
In DepthDetails ArticlePubMed