BDBM50053908 4-Cyano-N-{3-[1-(4-hydroxy-2-oxo-4a,5,6,7,8,9,10,10a-octahydro-2H-cycloocta[b]pyran-3-yl)-2,2-dimethyl-propyl]-phenyl}-benzenesulfonamide::CHEMBL336746
SMILES CC(C)(C)C(C1C(=O)OC2CCCCCCC2C1=O)c1cccc(NS(=O)(=O)c2ccc(cc2)C#N)c1
InChI Key InChIKey=CXYHRQAGHMZHPA-UHFFFAOYSA-N
Data  1 KI
  Tab Delimited (TSV)   2D SDfile   Computed 3D by Vconf -m prep SDfile
Find this compound or compounds like it in BindingDB:
Activity Spreadsheet -- Enzyme Inhibition Constant Data from BindingDB
Found 1 hit for monomerid = 50053908
TargetGag-Pol polyprotein [489-587](Human immunodeficiency virus type 1)
Pharmacia And Upjohn
Curated by ChEMBL
LigandPNGBDBM50053908(4-Cyano-N-{3-[1-(4-hydroxy-2-oxo-4a,5,6,7,8,9,10,1...)
Affinity DataKi:  0.200nM. Assay description: Binding affinity of the compound towards HIV protease was determined
In DepthDetails ArticlePubMed