BDBM50053994 (E)-6-(7-Ethyl-4-hydroxy-6-methoxy-3-oxo-1,3-dihydro-isobenzofuran-5-yl)-4-methyl-hex-4-enoic acid::CHEMBL132181
SMILES CCc1c2COC(=O)c2c(O)c(C\C=C(/C)CCC(O)=O)c1OC
InChI Key InChIKey=RKGFXWXUEJDGQC-BJMVGYQFSA-N
Data  1 IC50
  Tab Delimited (TSV)   2D SDfile   Computed 3D by Vconf -m prep SDfile
Find this compound or compounds like it in BindingDB:
Activity Spreadsheet -- Enzyme Inhibition Constant Data from BindingDB
Found 1 hit for monomerid = 50053994
TargetInosine-5'-monophosphate dehydrogenase 2(Homo sapiens (Human))
Syntex Research
Curated by ChEMBL
LigandPNGBDBM50053994((E)-6-(7-Ethyl-4-hydroxy-6-methoxy-3-oxo-1,3-dihyd...)
Affinity DataIC50:  410nMpH: 8.0Assay Description:Inhibition of human recombinant type II Inosine Monophosphate Dehydrogenase. at pH 8.0
In DepthDetails ArticlePubMed