BDBM50054001 6-(2-Methoxy-3,4-dimethyl-5-methylsulfenyloxy-phenyl)-4-methyl-hex-4-enoic acid::CHEMBL135123
SMILES COc1c(C)c(C)c(OSC)cc1C\C=C(/C)CCC(O)=O
InChI Key InChIKey=KFOVGMITSKHDSW-IZZDOVSWSA-N
Data  1 IC50
  Tab Delimited (TSV)   2D SDfile   Computed 3D by Vconf -m prep SDfile
Find this compound or compounds like it in BindingDB:
Activity Spreadsheet -- Enzyme Inhibition Constant Data from BindingDB
Found 1 hit for monomerid = 50054001
TargetInosine-5'-monophosphate dehydrogenase 2(Homo sapiens (Human))
Syntex Research
Curated by ChEMBL
LigandPNGBDBM50054001(6-(2-Methoxy-3,4-dimethyl-5-methylsulfenyloxy-phen...)
Affinity DataIC50: >1.00E+5nM. Assay description: Inhibition of human recombinant type II Inosine Monophosphate Dehydrogenase at 100 microM
In DepthDetails ArticlePubMed