BDBM50054003 (E)-6-(2-Amino-3-bromo-6-methoxy-4,5-dimethyl-phenyl)-4-methyl-hex-4-enoic acid::CHEMBL444599
SMILES COc1c(C)c(C)c(Br)c(N)c1C\C=C(/C)CCC(O)=O
InChI Key InChIKey=VCXINDOTUYUYIX-WEVVVXLNSA-N
Data  1 IC50
  Tab Delimited (TSV)   2D SDfile   Computed 3D by Vconf -m prep SDfile
Find this compound or compounds like it in BindingDB:
Activity Spreadsheet -- Enzyme Inhibition Constant Data from BindingDB
Found 1 hit for monomerid = 50054003
TargetInosine-5'-monophosphate dehydrogenase 2(Homo sapiens (Human))
Syntex Research
Curated by ChEMBL
LigandPNGBDBM50054003((E)-6-(2-Amino-3-bromo-6-methoxy-4,5-dimethyl-phen...)
Affinity DataIC50:  462nM. Assay description: Inhibition of human recombinant inosine monophosphate dehydrogenase type II .
In DepthDetails ArticlePubMed