BDBM50054009 (E)-6-(2-Hydroxy-6-methoxy-3,4,5-trimethyl-phenyl)-4-methyl-hex-4-enoic acid::CHEMBL132428
SMILES COc1c(C)c(C)c(C)c(O)c1C\C=C(/C)CCC(O)=O
InChI Key InChIKey=PKFBETWVLIEIDV-UXBLZVDNSA-N
Data  1 IC50
  Tab Delimited (TSV)   2D SDfile   Computed 3D by Vconf -m prep SDfile
Find this compound or compounds like it in BindingDB:
Activity Spreadsheet -- Enzyme Inhibition Constant Data from BindingDB
Found 1 hit for monomerid = 50054009
TargetInosine-5'-monophosphate dehydrogenase 2(Homo sapiens (Human))
Syntex Research
Curated by ChEMBL
LigandPNGBDBM50054009((E)-6-(2-Hydroxy-6-methoxy-3,4,5-trimethyl-phenyl)...)
Affinity DataIC50:  959nM. Assay description: Inhibition of human recombinant inosine monophosphate dehydrogenase type II .
In DepthDetails ArticlePubMed