BDBM50054019 (E)-6-(4-Hydroxy-6,7-dimethyl-3-oxo-1,3-dihydro-isobenzofuran-5-yl)-4-methyl-hex-4-enoic acid::CHEMBL443814
SMILES C\C(CCC(O)=O)=C/Cc1c(C)c(C)c2COC(=O)c2c1O
InChI Key InChIKey=XRYDHCHHAPNIMK-RUDMXATFSA-N
Data  1 IC50
  Tab Delimited (TSV)   2D SDfile   Computed 3D by Vconf -m prep SDfile
Find this compound or compounds like it in BindingDB:
Activity Spreadsheet -- Enzyme Inhibition Constant Data from BindingDB
Found 1 hit for monomerid = 50054019
TargetInosine-5'-monophosphate dehydrogenase 2(Homo sapiens (Human))
Syntex Research
Curated by ChEMBL
LigandPNGBDBM50054019((E)-6-(4-Hydroxy-6,7-dimethyl-3-oxo-1,3-dihydro-is...)
Affinity DataIC50:  18.6nMpH: 8.0Assay Description:Inhibition of human recombinant type II Inosine Monophosphate Dehydrogenase. at pH 8.0
In DepthDetails ArticlePubMed