BDBM50054021 (E)-6-(6-Ethyl-4-hydroxy-7-methyl-3-oxo-1,3-dihydro-isobenzofuran-5-yl)-4-methyl-hex-4-enoic acid::CHEMBL132070
SMILES CCc1c(C)c2COC(=O)c2c(O)c1C\C=C(/C)CCC(O)=O
InChI Key InChIKey=NLJZQYJXPYKUHI-BJMVGYQFSA-N
Data  1 IC50
  Tab Delimited (TSV)   2D SDfile   Computed 3D by Vconf -m prep SDfile
Find this compound or compounds like it in BindingDB:
Activity Spreadsheet -- Enzyme Inhibition Constant Data from BindingDB
Found 1 hit for monomerid = 50054021
TargetInosine-5'-monophosphate dehydrogenase 2(Homo sapiens (Human))
Syntex Research
Curated by ChEMBL
LigandPNGBDBM50054021((E)-6-(6-Ethyl-4-hydroxy-7-methyl-3-oxo-1,3-dihydr...)
Affinity DataIC50:  12.6nM. Assay description: Inhibition of human recombinant inosine monophosphate dehydrogenase type II .
In DepthDetails ArticlePubMed