BDBM50054133 6-(4-Chloro-phenyl)-6,7-dihydro-pyrrolo[3,4-b]pyridin-5-one::CHEMBL335923
SMILES Clc1ccc(cc1)-n1cc2[nH]cccc2c1=O
InChI Key InChIKey=BABBUQVSIQRFEG-UHFFFAOYSA-N
Data  1 IC50
  Tab Delimited (TSV)   2D SDfile   Computed 3D by Vconf -m prep SDfile
Find this compound or compounds like it in BindingDB:
Activity Spreadsheet -- Enzyme Inhibition Constant Data from BindingDB
Found 1 hit for monomerid = 50054133
TargetTranslocator protein(Rattus norvegicus (rat))
Università
Curated by ChEMBL
LigandPNGBDBM50054133(6-(4-Chloro-phenyl)-6,7-dihydro-pyrrolo[3,4-b]pyri...)
Affinity DataIC50: >1.00E+3nM. Assay description: Binding affinity against peripheral benzodiazepine receptor( PBR).
In DepthDetails ArticlePubMed