BDBM50054134 2-[6-(4-Chloro-phenyl)-5-oxo-5,6-dihydro-pyrrolo[3,4-b]pyridin-(7E)-ylidene]-N,N-dipropyl-acetamide::CHEMBL136030
SMILES CCCN(CCC)C(=O)\C=C1\N(C(=O)c2cccnc12)c1ccc(Cl)cc1
InChI Key InChIKey=QXRYSBDDBRGKOJ-NBVRZTHBSA-N
Data  1 IC50
  Tab Delimited (TSV)   2D SDfile   Computed 3D by Vconf -m prep SDfile
Find this compound or compounds like it in BindingDB:
Activity Spreadsheet -- Enzyme Inhibition Constant Data from BindingDB
Found 1 hit for monomerid = 50054134
TargetTranslocator protein(Rattus norvegicus (rat))
Università
Curated by ChEMBL
LigandPNGBDBM50054134(2-[6-(4-Chloro-phenyl)-5-oxo-5,6-dihydro-pyrrolo[3...)
Affinity DataIC50:  290nM. Assay description: Binding affinity against peripheral benzodiazepine receptor( PBR).
In DepthDetails ArticlePubMed