BDBM50054163 1N-(tert-butyl)-3-[4,7-dibenzyl-3-[3-(tert-butylcarbamoyl)benzyl]-5,6-dihydroxy-2-oxo-(4R,5S,6S,7R)-1,3-diazepan-1-ylmethyl]benzamide::CHEMBL313516
SMILES CC(C)(C)NC(=O)c1cccc(CN2[C@H](Cc3ccccc3)[C@H](O)[C@@H](O)[C@@H](Cc3ccccc3)N(Cc3cccc(c3)C(=O)NC(C)(C)C)C2=O)c1
InChI Key InChIKey=AJLWKZXUZZZONU-RNATXAOGSA-N
Data  3 KI
  Tab Delimited (TSV)   2D SDfile   Computed 3D by Vconf -m prep SDfile
Find this compound or compounds like it in BindingDB:
Activity Spreadsheet -- Enzyme Inhibition Constant Data from BindingDB
Found 3 hits for monomerid = 50054163
TargetGag-Pol polyprotein [489-587](Human immunodeficiency virus type 1)
Dupont Pharmaceuticals
Curated by ChEMBL
LigandPNGBDBM50054163(1N-(tert-butyl)-3-[4,7-dibenzyl-3-[3-(tert-butylca...)
Affinity DataKi:  2.40nM. Assay description: Inhibitory activity against HIV-1 protease
In DepthDetails ArticlePubMed
TargetGag-Pol polyprotein [489-587](Human immunodeficiency virus type 1)
Dupont Pharmaceuticals
Curated by ChEMBL
LigandPNGBDBM50054163(1N-(tert-butyl)-3-[4,7-dibenzyl-3-[3-(tert-butylca...)
Affinity DataKi:  2.40nM. Assay description: Inhibition of HIV-1 protease
In DepthDetails ArticlePubMed
TargetGag-Pol polyprotein [489-587](Human immunodeficiency virus type 1)
Dupont Pharmaceuticals
Curated by ChEMBL
LigandPNGBDBM50054163(1N-(tert-butyl)-3-[4,7-dibenzyl-3-[3-(tert-butylca...)
Affinity DataKi:  2.60nM. Assay description: Binding affinity for HIV-1 protease
In DepthDetails ArticlePubMed