BDBM50054316 2-Carboxymethyl-3-oxo-3,5-dihydro-2H-indeno[1,2-c]pyridazine-4-carboxylic acid::CHEMBL136137
SMILES OC(=O)Cn1nc2-c3ccccc3Cc2c(C(O)=O)c1=O
InChI Key InChIKey=QVTXBBVXWUUCFC-UHFFFAOYSA-N
Data  1 IC50
  Tab Delimited (TSV)   2D SDfile   Computed 3D by Vconf -m prep SDfile
Find this compound or compounds like it in BindingDB:
Activity Spreadsheet -- Enzyme Inhibition Constant Data from BindingDB
Found 1 hit for monomerid = 50054316
TargetAldo-keto reductase family 1 member A1(Rattus norvegicus)
TBA
Curated by ChEMBL
LigandPNGBDBM50054316(2-Carboxymethyl-3-oxo-3,5-dihydro-2H-indeno[1,2-c]...)
Affinity DataIC50:  1.36E+5nM. Assay description: Evaluated for inhibition of Aldehyde reductase 1
In DepthDetails ArticlePubMed