BDBM50054324 (3-Oxo-3,5-dihydro-indeno[1,2-c]pyridazin-2-yl)-acetic acid::CHEMBL433688
SMILES OC(=O)Cn1nc-2c(Cc3ccccc-23)cc1=O
InChI Key InChIKey=WUBNQDDDKTUJJR-UHFFFAOYSA-N
Data  1 IC50
  Tab Delimited (TSV)   2D SDfile   Computed 3D by Vconf -m prep SDfile
Find this compound or compounds like it in BindingDB:
Activity Spreadsheet -- Enzyme Inhibition Constant Data from BindingDB
Found 1 hit for monomerid = 50054324
TargetAldo-keto reductase family 1 member A1(Rattus norvegicus)
TBA
Curated by ChEMBL
LigandPNGBDBM50054324((3-Oxo-3,5-dihydro-indeno[1,2-c]pyridazin-2-yl)-ac...)
Affinity DataIC50:  1.07E+5nM. Assay description: Evaluated for inhibition of Aldehyde reductase 1
In DepthDetails ArticlePubMed