BDBM50054608 4-Hydroxy-6-phenyl-3-(1-phenyl-propyl)-6-propyl-5,6-dihydro-pyran-2-one::CHEMBL140468
SMILES CCCC1(CC(=O)C(C(CC)c2ccccc2)C(=O)O1)c1ccccc1
InChI Key InChIKey=NVJXNSJZXFPQQY-UHFFFAOYSA-N
Data  1 KI
  Tab Delimited (TSV)   2D SDfile   Computed 3D by Vconf -m prep SDfile
Find this compound or compounds like it in BindingDB:
Activity Spreadsheet -- Enzyme Inhibition Constant Data from BindingDB
Found 1 hit for monomerid = 50054608
TargetGag-Pol polyprotein [489-587](Human immunodeficiency virus type 1)
Pharmacia & Upjohn
Curated by ChEMBL
LigandPNGBDBM50054608(4-Hydroxy-6-phenyl-3-(1-phenyl-propyl)-6-propyl-5,...)
Affinity DataKi:  95nM. Assay description: HIV Protease inhibitory activity
In DepthDetails ArticlePubMed