BDBM50054616 3-(1,3-Diphenyl-propyl)-4-hydroxy-6-phenethyl-6-propyl-5,6-dihydro-pyran-2-one::CHEMBL143773
SMILES CCCC1(CCc2ccccc2)CC(=O)C(C(CCc2ccccc2)c2ccccc2)C(=O)O1
InChI Key InChIKey=FUCIJVRNOAVLDH-UHFFFAOYSA-N
Data  1 KI
  Tab Delimited (TSV)   2D SDfile   Computed 3D by Vconf -m prep SDfile
Find this compound or compounds like it in BindingDB:
Activity Spreadsheet -- Enzyme Inhibition Constant Data from BindingDB
Found 1 hit for monomerid = 50054616
TargetGag-Pol polyprotein [489-587](Human immunodeficiency virus type 1)
Pharmacia & Upjohn
Curated by ChEMBL
LigandPNGBDBM50054616(3-(1,3-Diphenyl-propyl)-4-hydroxy-6-phenethyl-6-pr...)
Affinity DataKi:  33nM. Assay description: HIV Protease inhibitory activity
In DepthDetails ArticlePubMed